Reaction Details
TargetPlatelet-derived growth factor receptor beta
LigandBDBM50134893
Substrate/Competitorn/a
Meas. Tech.ChEMBL_158653 (CHEMBL763439)
IC50>30000±n/a nM
Citation Matsuno, KUshiki, JSeishi, TIchimura, MGiese, NAYu, JCTakahashi, SOda, SNomoto, Y Potent and selective inhibitors of platelet-derived growth factor receptor phosphorylation. 3. Replacement of quinazoline moiety and improvement of metabolic polymorphism of 4-[4-(N-substituted (thio)carbamoyl)-1-piperazinyl]-6,7-dimethoxyquinazoline derivatives. J Med Chem46:4910-25 (2003) 
 
Platelet-derived growth factor receptor beta
Name:Platelet-derived growth factor receptor beta
Type:Enzyme
Mol. Mass.:123922.25
Organism:Homo sapiens (Human)
Description:P09619
Residue:1106
BDBM50134893
NameBDBM50134893
Synonyms:4-(4-Chloro-phthalazin-1-yl)-piperazine-1-carboxylic acid (4-phenoxy-phenyl)-amide | CHEMBL359204
TypeSmall organic molecule
Emp. Form.C25H22ClN5O2
Mol. Mass.459.927
SMILESClc1nnc(N2CCN(CC2)C(=O)Nc2ccc(Oc3ccccc3)cc2)c2ccccc12