Reaction Details
TargetPlatelet-derived growth factor receptor beta
LigandBDBM50134894
Substrate/Competitorn/a
Meas. Tech.ChEMBL_158653 (CHEMBL763439)
IC50>10000±n/a nM
Citation Matsuno, KUshiki, JSeishi, TIchimura, MGiese, NAYu, JCTakahashi, SOda, SNomoto, Y Potent and selective inhibitors of platelet-derived growth factor receptor phosphorylation. 3. Replacement of quinazoline moiety and improvement of metabolic polymorphism of 4-[4-(N-substituted (thio)carbamoyl)-1-piperazinyl]-6,7-dimethoxyquinazoline derivatives. J Med Chem46:4910-25 (2003) 
 
Platelet-derived growth factor receptor beta
Name:Platelet-derived growth factor receptor beta
Type:Enzyme
Mol. Mass.:123922.25
Organism:Homo sapiens (Human)
Description:P09619
Residue:1106
BDBM50134894
NameBDBM50134894
Synonyms:4-(8-Oxo-8,9-dihydro-7H-purin-6-yl)-piperazine-1-carboxylic acid (4-phenoxy-phenyl)-amide | CHEMBL147052
TypeSmall organic molecule
Emp. Form.C22H21N7O3
Mol. Mass.431.4472
SMILESO=C(Nc1ccc(Oc2ccccc2)cc1)N1CCN(CC1)c1ncnc2[nH]c(=O)[nH]c12