Reaction Details
TargetPlatelet-derived growth factor receptor beta
LigandBDBM50134904
Substrate/Competitorn/a
Meas. Tech.ChEMBL_158653 (CHEMBL763439)
IC50 1390±n/a nM
Citation Matsuno, KUshiki, JSeishi, TIchimura, MGiese, NAYu, JCTakahashi, SOda, SNomoto, Y Potent and selective inhibitors of platelet-derived growth factor receptor phosphorylation. 3. Replacement of quinazoline moiety and improvement of metabolic polymorphism of 4-[4-(N-substituted (thio)carbamoyl)-1-piperazinyl]-6,7-dimethoxyquinazoline derivatives. J Med Chem46:4910-25 (2003) 
 
Platelet-derived growth factor receptor beta
Name:Platelet-derived growth factor receptor beta
Type:Enzyme
Mol. Mass.:123922.25
Organism:Homo sapiens (Human)
Description:P09619
Residue:1106
BDBM50134904
NameBDBM50134904
Synonyms:4-(6-Butoxy-7-methoxy-quinazolin-4-yl)-piperazine-1-carboxylic acid (4-phenoxy-phenyl)-amide | CHEMBL148225
TypeSmall organic molecule
Emp. Form.C30H33N5O4
Mol. Mass.527.6141
SMILESCCCCOc1cc2c(ncnc2cc1OC)N1CCN(CC1)C(=O)Nc1ccc(Oc2ccccc2)cc1