Reaction Details
TargetMelanocortin receptor 3
LigandBDBM50134947
Substrate/Competitorn/a
Meas. Tech.ChEMBL_106018 (CHEMBL718190)
Ki 15±n/a nM
Citation Balse-Srinivasan, PGrieco, PCai, MTrivedi, DHruby, VJ Structure-activity relationships of gamma-MSH analogues at the human melanocortin MC3, MC4, and MC5 receptors. Discovery of highly selective hMC3R, hMC4R, and hMC5R analogues. J Med Chem46:4965-73 (2003) 
 
Melanocortin receptor 3
Name:Melanocortin receptor 3
Type:Enzyme
Mol. Mass.:36044.86
Organism:Homo sapiens (Human)
Description:P41968
Residue:323
BDBM50134947
NameBDBM50134947
Synonyms:CHEMBL2370963 | H-Tyr-Val-Nle-Gly-His-Phe-Arg-D-Nal(2')-Asp-Arg-Phe-Gly-NH2
TypeSmall organic molecule
Emp. Form.C77H103N21O15
Mol. Mass.1562.7734
SMILESCCCC[C@H](NC(=O)[C@@H](NC(=O)[C@@H](N)Cc1ccc(O)cc1)C(C)C)C(=O)NCC(=O)N[C@@H](Cc1c[nH]cn1)C(=O)N[C@@H](Cc1ccccc1)C(=O)N[C@@H](CCCN=C(N)N)C(=O)N[C@H](Cc1ccc2ccccc2c1)C(=O)N[C@@H](CC(O)=O)C(=O)N[C@@H](CCCN=C(N)N)C(=O)N[C@@H](Cc1ccccc1)C(=O)NCC(N)=O