Reaction Details
TargetMelanocortin receptor 4
LigandBDBM50134955
Substrate/Competitorn/a
Meas. Tech.ChEMBL_106324 (CHEMBL709895)
EC50 50±n/a nM
Citation Balse-Srinivasan, PGrieco, PCai, MTrivedi, DHruby, VJ Structure-activity relationships of gamma-MSH analogues at the human melanocortin MC3, MC4, and MC5 receptors. Discovery of highly selective hMC3R, hMC4R, and hMC5R analogues. J Med Chem46:4965-73 (2003) 
 
Melanocortin receptor 4
Name:Melanocortin receptor 4
Type:Enzyme
Mol. Mass.:36949.50
Organism:Homo sapiens (Human)
Description:P32245
Residue:332
BDBM50134955
NameBDBM50134955
Synonyms:CHEMBL2370968 | H-Tyr-Val-Nle-Gly-Pro-D-Nal(2')-Arg-Trp-Asp-Arg-Phe-Gly-NH2
TypeSmall organic molecule
Emp. Form.C78H104N20O15
Mol. Mass.1561.7854
SMILESCCCC[C@H](NC(=O)[C@@H](NC(=O)[C@@H](N)Cc1ccc(O)cc1)C(C)C)C(=O)NCC(=O)N1CCC[C@H]1C(=O)N[C@H](Cc1ccc2ccccc2c1)C(=O)N[C@@H](CCCN=C(N)N)C(=O)N[C@@H](Cc1c[nH]c2ccccc12)C(=O)N[C@@H](CC(O)=O)C(=O)N[C@@H](CCCN=C(N)N)C(=O)N[C@@H](Cc1ccccc1)C(=O)NCC(N)=O