Reaction Details
TargetMelanocortin receptor 5
LigandBDBM50134946
Substrate/Competitorn/a
Meas. Tech.ChEMBL_106523 (CHEMBL713027)
EC50>10000±n/a nM
Citation Balse-Srinivasan, PGrieco, PCai, MTrivedi, DHruby, VJ Structure-activity relationships of gamma-MSH analogues at the human melanocortin MC3, MC4, and MC5 receptors. Discovery of highly selective hMC3R, hMC4R, and hMC5R analogues. J Med Chem46:4965-73 (2003) 
 
Melanocortin receptor 5
Name:Melanocortin receptor 5
Type:Enzyme
Mol. Mass.:36612.92
Organism:Homo sapiens (Human)
Description:P33032
Residue:325
BDBM50134946
NameBDBM50134946
Synonyms:CHEMBL2370964 | H-Tyr-Val-Nle-Gly-His-D-Nal(2')-Arg-Trp-Asp-Arg-Phe-Gly-NH2
TypeSmall organic molecule
Emp. Form.C79H104N22O15
Mol. Mass.1601.8095
SMILESCCCC[C@H](NC(=O)[C@@H](NC(=O)[C@@H](N)Cc1ccc(O)cc1)C(C)C)C(=O)NCC(=O)N[C@@H](Cc1c[nH]cn1)C(=O)N[C@H](Cc1ccc2ccccc2c1)C(=O)N[C@@H](CCCN=C(N)N)C(=O)N[C@@H](Cc1c[nH]c2ccccc12)C(=O)N[C@@H](CC(O)=O)C(=O)N[C@@H](CCCN=C(N)N)C(=O)N[C@@H](Cc1ccccc1)C(=O)NCC(N)=O