Reaction Details
TargetBeta-secretase 1
LigandBDBM50135163
Substrate/Competitorn/a
Meas. Tech.ChEMBL_41386 (CHEMBL653508)
Ki 210±n/a nM
Citation Jeon, SYBae, KSeong, YHSong, KS Green tea catechins as a BACE1 (beta-secretase) inhibitor. Bioorg Med Chem Lett13:3905-8 (2003) Beta-secretase 1
Name:Beta-secretase 1
Type:Protein
Mol. Mass.:55755.10
Organism:Homo sapiens (Human)
Description:P56817
Residue:501
BDBM50135163
NameBDBM50135163
Synonyms:3,4,5-Trihydroxy-benzoic acid (2S,3S)-5,7-dihydroxy-2-(3,4,5-trihydroxy-phenyl)-chroman-3-yl ester | CHEMBL338988
TypeSmall organic molecule
Emp. Form.C22H18O11
Mol. Mass.458.3717
SMILESOc1cc(O)c2C[C@H](OC(=O)c3cc(O)c(O)c(O)c3)[C@@H](Oc2c1)c1cc(O)c(O)c(O)c1