Reaction Details
TargetBeta-secretase 1
LigandBDBM50135164
Substrate/Competitorn/a
Meas. Tech.ChEMBL_41385 (CHEMBL653507)
IC50 4500±n/a nM
Citation Jeon, SYBae, KSeong, YHSong, KS Green tea catechins as a BACE1 (beta-secretase) inhibitor. Bioorg Med Chem Lett13:3905-8 (2003) Beta-secretase 1
Name:Beta-secretase 1
Type:Protein
Mol. Mass.:55755.10
Organism:Homo sapiens (Human)
Description:P56817
Residue:501
BDBM50135164
NameBDBM50135164
Synonyms:3,4,5-Trihydroxy-benzoic acid (2S,3S)-2-(3,4-dihydroxy-phenyl)-5,7-dihydroxy-chroman-3-yl ester | CHEMBL126142
TypeSmall organic molecule
Emp. Form.C22H18O10
Mol. Mass.442.3723
SMILESOc1cc(O)c2C[C@H](OC(=O)c3cc(O)c(O)c(O)c3)[C@@H](Oc2c1)c1ccc(O)c(O)c1