Reaction Details
TargetSodium-dependent serotonin transporter
LigandBDBM50135263
Substrate/Competitorn/a
Meas. Tech.ChEBML_194030
Ki 0.560000±n/a nM
Citation Takeuchi, KKohn, TJHonigschmidt, NARocco, VPSpinazze, PGAtkinson, STHertel, LWNelson, DLWainscott, DBAhmad, LJShaw, JThrelkeld, PGWong, DT Advances toward new antidepressants beyond SSRIs: 1-aryloxy-3-piperidinylpropan-2-ols with dual 5-HT1A receptor antagonism/SSRI activities. Part 3. Bioorg Med Chem Lett13:3939-42 (2003) Sodium-dependent serotonin transporter
Name:Sodium-dependent serotonin transporter
Type:Multi-pass membrane protein
Mol. Mass.:70168.43
Organism:Rattus norvegicus (rat)
Description:P31652
Residue:630
BDBM50135263
NameBDBM50135263
Synonyms:4-{(S)-2-Hydroxy-3-[(2S,4R)-4-(4-methoxy-benzo[b]thiophen-2-yl)-2-methyl-piperidin-1-yl]-propoxy}-1H-indole-2-carboxylic acid amide | CHEMBL129433
TypeSmall organic molecule
Emp. Form.C27H31N3O4S
Mol. Mass.493.618
SMILESCOc1cccc2sc(cc12)[C@@H]1CCN(C[C@H](O)COc2cccc3[nH]c(cc23)C(N)=O)[C@@H](C)C1