Reaction Details
TargetGeranylgeranyl transferase type-1 subunit beta/Protein farnesyltransferase/geranylgeranyltransferase type-1 subunit alpha
LigandBDBM50135364
Substrate/Competitorn/a
Meas. Tech.ChEMBL_71984 (CHEMBL683536)
IC50 3300±n/a nM
Citation Hasvold, LAWang, WGwaltney, SLRockway, TWNelson, LTMantei, RAFakhoury, SASullivan, GMLi, QLin, NHWang, LZhang, HCohen, JGu, WZMarsh, KBauch, JRosenberg, SSham, HL Pyridone-containing farnesyltransferase inhibitors: synthesis and biological evaluation. Bioorg Med Chem Lett13:4001-5 (2003) Geranylgeranyl transferase type-1 subunit beta/Protein farnesyltransferase/geranylgeranyltransferase type-1 subunit alpha
Name:Geranylgeranyl transferase type-1 subunit beta/Protein farnesyltransferase/geranylgeranyltransferase type-1 subunit alpha
Type:n/a
Mol. Mass.:n/a
Description:ASSAY_ID of EBI is 70196
Components:This complex has 2 components.
Component 1
Name:Protein farnesyltransferase/geranylgeranyltransferase type-1 subunit alpha
Synonyms:CAAX farnesyltransferase alpha subunit FNTA_HUMAN FTase-alpha Geranylgeranyl Transferase (GGTase-I) Chain A Protein Farnesyltransferase (PFT) Chain A Protein farnesyltransferase Protein farnesyltransferase/geranylgeranyltransferase type I alpha subunit | Ras proteins prenyltransferase alpha
Type:Enzyme
Mol. Mass.:44392.46
Organism:Homo sapiens (Human)
Description:Recombinant human FTase.
Residue:379
Component 2
Name:Geranylgeranyl transferase type-1 subunit beta
Synonyms:2.5.1.59 Geranylgeranyl transferase type I Geranylgeranyl transferase type I subunit beta PGGT1B Protein farnesyl/geranylgeranyl transferase | Type I protein geranyl-geranyltransferase subunit beta
Type:n/a
Mol. Mass.:42369.84
Organism:Homo sapiens (Human)
Description:n/a
Residue:377
BDBM50135364
NameBDBM50135364
Synonyms:5-(3-Chloro-phenyl)-6-[(4-cyano-phenyl)-(3-methyl-3H-imidazol-4-yl)-methoxymethyl]-1-ethyl-2-oxo-1,2-dihydro-pyridine-3-carbonitrile | CHEMBL128282
TypeSmall organic molecule
Emp. Form.C27H22ClN5O2
Mol. Mass.483.949
SMILESCCn1c(COC(c2cncn2C)c2ccc(cc2)C#N)c(cc(C#N)c1=O)-c1cccc(Cl)c1