Reaction Details
TargetGenome polyprotein/Non-structural protein 4A
LigandBDBM50135449
Substrate/Competitorn/a
Meas. Tech.ChEMBL_143629 (CHEMBL752790)
Ki 3900±n/a nM
Citation Perni, RBBritt, SDCourt, JCCourtney, LFDeininger, DDFarmer, LJGates, CAHarbeson, SLKim, JLLandro, JALevin, RBLuong, YPO'Malley, ETPitlik, JRao, BGSchairer, WCThomson, JATung, RDVan Drie, JHWei, Y Inhibitors of hepatitis C virus NS3.4A protease 1. Non-charged tetrapeptide variants. Bioorg Med Chem Lett13:4059-63 (2003) Genome polyprotein/Non-structural protein 4A
Name:Genome polyprotein/Non-structural protein 4A
Synonyms:Hepatitis C virus serine protease, NS3/NS4A
Type:n/a
Mol. Mass.:n/a
Description:ASSAY_ID of ChEMBL is 1969955
Components:This complex has 2 components.
Component 1
Name:Non-structural protein 4A
Type:PROTEIN
Mol. Mass.:5762.65
Organism:Hepatitis C virus
Description:ChEMBL_305334
Residue:54
Component 2
Name:Genome polyprotein
Synonyms:Hepatitis C virus NS3 protease/helicase | Hepatitis C virus serine protease, NS3/NS4A
Type:Protein
Mol. Mass.:67067.41
Organism:Hepatitis C virus
Description:A3EZI9
Residue:631
BDBM50135449
NameBDBM50135449
Synonyms:CHEMBL130397 | Pyrazine-2-carboxylic acid ((R)-1-{(R)-1-[(2S,4R)-2-((S)-1-formyl-propylcarbamoyl)-4-phenoxy-pyrrolidine-1-carbonyl]-2-methyl-propylcarbamoyl}-2-methyl-propyl)-amide
TypeSmall organic molecule
Emp. Form.C30H40N6O6
Mol. Mass.580.6752
SMILESCC[C@H](NC(=O)[C@@H]1C[C@H](CN1C(=O)[C@H](NC(=O)[C@H](NC(=O)c1cnccn1)C(C)C)C(C)C)Oc1ccccc1)C=O