Reaction Details
TargetGenome polyprotein/Non-structural protein 4A
LigandBDBM50135438
Substrate/Competitorn/a
Meas. Tech.ChEMBL_143629 (CHEMBL752790)
Ki 3100±n/a nM
Citation Perni, RBBritt, SDCourt, JCCourtney, LFDeininger, DDFarmer, LJGates, CAHarbeson, SLKim, JLLandro, JALevin, RBLuong, YPO'Malley, ETPitlik, JRao, BGSchairer, WCThomson, JATung, RDVan Drie, JHWei, Y Inhibitors of hepatitis C virus NS3.4A protease 1. Non-charged tetrapeptide variants. Bioorg Med Chem Lett13:4059-63 (2003) Genome polyprotein/Non-structural protein 4A
Name:Genome polyprotein/Non-structural protein 4A
Synonyms:Hepatitis C virus serine protease, NS3/NS4A
Type:n/a
Mol. Mass.:n/a
Description:ASSAY_ID of ChEMBL is 1969955
Components:This complex has 2 components.
Component 1
Name:Non-structural protein 4A
Type:PROTEIN
Mol. Mass.:5762.65
Organism:Hepatitis C virus
Description:ChEMBL_305334
Residue:54
Component 2
Name:Genome polyprotein
Synonyms:Hepatitis C virus NS3 protease/helicase | Hepatitis C virus serine protease, NS3/NS4A
Type:Protein
Mol. Mass.:67067.41
Organism:Hepatitis C virus
Description:A3EZI9
Residue:631
BDBM50135438
NameBDBM50135438
Synonyms:CHEMBL339012 | Pyrazine-2-carboxylic acid ((S)-1-{(S)-1-[(2S,4R)-4-benzyloxy-2-(3,3,3-trifluoro-1-formyl-propylcarbamoyl)-pyrrolidine-1-carbonyl]-2-methyl-propylcarbamoyl}-2-methyl-propyl)-amide
TypeSmall organic molecule
Emp. Form.C31H39F3N6O6
Mol. Mass.648.6732
SMILESCC(C)[C@H](NC(=O)c1cnccn1)C(=O)N[C@@H](C(C)C)C(=O)N1C[C@@H](C[C@H]1C(=O)NC(CC(F)(F)F)C=O)OCc1ccccc1