Reaction Details
TargetPeroxisome proliferator-activated receptor gamma
LigandBDBM50135451
Substrate/Competitorn/a
Meas. Tech.ChEMBL_44520 (CHEMBL656170)
EC50 0.700000±n/a nM
Citation Michellys, PYBoehm, MFChen, JHGrese, TAKaranewsky, DSLeibowitz, MDLiu, SMais, DAMapes, CMReifel-Miller, AOgilvie, KMRungta, DThompson, AWTyhonas, JSYumibe, NArdecky, RJ Design and synthesis of novel RXR-selective modulators with improved pharmacological profile. Bioorg Med Chem Lett13:4071-5 (2003) Peroxisome proliferator-activated receptor gamma
Name:Peroxisome proliferator-activated receptor gamma
Type:Nuclear Receptor
Mol. Mass.:57613.46
Organism:Homo sapiens (Human)
Description:P37231
Residue:505
BDBM50135451
NameBDBM50135451
Synonyms:(2E,4E,6Z)-7-(2-Ethoxy-3-isopropyl-5-pentafluoroethyl-phenyl)-3-methyl-octa-2,4,6-trienoic acid | CHEMBL133896
TypeSmall organic molecule
Emp. Form.C22H25F5O3
Mol. Mass.432.4241
SMILESCCOc1c(cc(cc1\C(C)=C/C=C/C(/C)=C/C(O)=O)C(F)(F)C(F)(F)F)C(C)C