Reaction Details
TargetPeroxisome proliferator-activated receptor gamma
LigandBDBM50135450
Substrate/Competitorn/a
Meas. Tech.ChEMBL_44520 (CHEMBL656170)
EC50 0.400000±n/a nM
Citation Michellys, PYBoehm, MFChen, JHGrese, TAKaranewsky, DSLeibowitz, MDLiu, SMais, DAMapes, CMReifel-Miller, AOgilvie, KMRungta, DThompson, AWTyhonas, JSYumibe, NArdecky, RJ Design and synthesis of novel RXR-selective modulators with improved pharmacological profile. Bioorg Med Chem Lett13:4071-5 (2003) Peroxisome proliferator-activated receptor gamma
Name:Peroxisome proliferator-activated receptor gamma
Type:Nuclear Receptor
Mol. Mass.:57613.46
Organism:Homo sapiens (Human)
Description:P37231
Residue:505
BDBM50135450
NameBDBM50135450
Synonyms:(2E,4E,6Z)-7-[4-(2,2-Difluoro-ethoxy)-2'-fluoro-5-isopropyl-biphenyl-3-yl]-3-methyl-octa-2,4,6-trienoic acid | CHEMBL422088
TypeSmall organic molecule
Emp. Form.C26H27F3O3
Mol. Mass.444.486
SMILESCC(C)c1cc(cc(\C(C)=C/C=C/C(/C)=C/C(O)=O)c1OCC(F)F)-c1ccccc1F