Reaction Details
TargetRetinoic acid receptor RXR-gamma
LigandBDBM50135454
Substrate/Competitorn/a
Meas. Tech.ChEBML_197090
Ki 28±n/a nM
Citation Michellys, PYBoehm, MFChen, JHGrese, TAKaranewsky, DSLeibowitz, MDLiu, SMais, DAMapes, CMReifel-Miller, AOgilvie, KMRungta, DThompson, AWTyhonas, JSYumibe, NArdecky, RJ Design and synthesis of novel RXR-selective modulators with improved pharmacological profile. Bioorg Med Chem Lett13:4071-5 (2003) Retinoic acid receptor RXR-gamma
Name:Retinoic acid receptor RXR-gamma
Type:PROTEIN
Mol. Mass.:50878.26
Organism:Homo sapiens (Human)
Description:ChEMBL_197216
Residue:463
BDBM50135454
NameBDBM50135454
Synonyms:(2E,4E,6Z)-7-(3-Isopropyl-5-pentafluoroethyl-2-propoxy-phenyl)-3-methyl-octa-2,4,6-trienoic acid | CHEMBL132568
TypeSmall organic molecule
Emp. Form.C23H27F5O3
Mol. Mass.446.4507
SMILESCCCOc1c(cc(cc1\C(C)=C/C=C/C(/C)=C/C(O)=O)C(F)(F)C(F)(F)F)C(C)C