Reaction Details
TargetRetinoic acid receptor alpha
LigandBDBM50129720
Substrate/Competitorn/a
Meas. Tech.ChEBML_197251
Ki 54±n/a nM
Citation Michellys, PYBoehm, MFChen, JHGrese, TAKaranewsky, DSLeibowitz, MDLiu, SMais, DAMapes, CMReifel-Miller, AOgilvie, KMRungta, DThompson, AWTyhonas, JSYumibe, NArdecky, RJ Design and synthesis of novel RXR-selective modulators with improved pharmacological profile. Bioorg Med Chem Lett13:4071-5 (2003) Retinoic acid receptor alpha
Name:Retinoic acid receptor alpha
Type:PROTEIN
Mol. Mass.:50778.87
Organism:Homo sapiens (Human)
Description:ChEMBL_1466191
Residue:462
BDBM50129720
NameBDBM50129720
Synonyms:(2E,4E,6Z)-7-[3,5-Di-tert-butyl-2-(2,2-difluoro-ethoxy)-phenyl]-3-methyl-octa-2,4,6-trienoic acid CHEMBL42314
TypeSmall organic molecule
Emp. Form.C25H34F2O3
Mol. Mass.420.5325
SMILESC\C(\C=C\C=C(\C)c1cc(cc(c1OCC(F)F)C(C)(C)C)C(C)(C)C)=C/C(O)=O