Reaction Details
TargetRetinoic acid receptor beta
LigandBDBM50132580
Substrate/Competitorn/a
Meas. Tech.ChEBML_195468
Ki 5681±n/a nM
Citation Michellys, PYBoehm, MFChen, JHGrese, TAKaranewsky, DSLeibowitz, MDLiu, SMais, DAMapes, CMReifel-Miller, AOgilvie, KMRungta, DThompson, AWTyhonas, JSYumibe, NArdecky, RJ Design and synthesis of novel RXR-selective modulators with improved pharmacological profile. Bioorg Med Chem Lett13:4071-5 (2003) Retinoic acid receptor beta
Name:Retinoic acid receptor beta
Type:PROTEIN
Mol. Mass.:50498.70
Organism:Homo sapiens (Human)
Description:ChEMBL_1458015
Residue:455
BDBM50132580
NameBDBM50132580
Synonyms:(2E,4E,6E)-7-[3,5-Di-tert-butyl-2-(2,2-difluoro-ethoxy)-phenyl]-6-fluoro-3-methyl-octa-2,4,6-trienoic acid | CHEMBL111217
TypeSmall organic molecule
Emp. Form.C25H33F3O3
Mol. Mass.438.5229
SMILESC\C(\C=C\C(\F)=C(\C)c1cc(cc(c1OCC(F)F)C(C)(C)C)C(C)(C)C)=C/C(O)=O