Reaction Details
TargetRetinoic acid receptor RXR-beta
LigandBDBM50135462
Substrate/Competitorn/a
Meas. Tech.ChEBML_196926
Ki 7.4±n/a nM
Citation Michellys, PYBoehm, MFChen, JHGrese, TAKaranewsky, DSLeibowitz, MDLiu, SMais, DAMapes, CMReifel-Miller, AOgilvie, KMRungta, DThompson, AWTyhonas, JSYumibe, NArdecky, RJ Design and synthesis of novel RXR-selective modulators with improved pharmacological profile. Bioorg Med Chem Lett13:4071-5 (2003) Retinoic acid receptor RXR-beta
Name:Retinoic acid receptor RXR-beta
Type:PROTEIN
Mol. Mass.:56932.89
Organism:Homo sapiens (Human)
Description:ChEMBL_39045
Residue:533
BDBM50135462
NameBDBM50135462
Synonyms:(2E,4E,6Z)-7-[4-(2,2-Difluoro-ethoxy)-3'-fluoro-5-isopropyl-biphenyl-3-yl]-3-methyl-octa-2,4,6-trienoic acid | CHEMBL130232
TypeSmall organic molecule
Emp. Form.C26H27F3O3
Mol. Mass.444.486
SMILESCC(C)c1cc(cc(\C(C)=C/C=C/C(/C)=C/C(O)=O)c1OCC(F)F)-c1cccc(F)c1