Reaction Details
TargetChymotrypsin-C
LigandBDBM50135493
Substrate/Competitorn/a
Meas. Tech.ChEBML_49615
IC50>1000±n/a nM
Citation Masaki, HMizuno, YTatui, AMurakami, AKoide, YSatoh, STakahashi, A Structure-activity relationship of benzo[b]thiophene-2-sulfonamide derivatives as novel human chymase inhibitors. Bioorg Med Chem Lett13:4085-8 (2003) Chymotrypsin-C
Name:Chymotrypsin-C
Type:Enzyme
Mol. Mass.:29487.98
Organism:Homo sapiens (Human)
Description:Q99895
Residue:268
BDBM50135493
NameBDBM50135493
Synonyms:5-Fluoro-3-methyl-benzo[b]thiophene-2-sulfonic acid (4-acetyl-2-methanesulfonyl-phenyl)-amide | CHEMBL335613
TypeSmall organic molecule
Emp. Form.C18H16FNO5S3
Mol. Mass.441.517
SMILESCC(=O)c1ccc(NS(=O)(=O)c2sc3ccc(F)cc3c2C)c(c1)S(C)(=O)=O