Reaction Details
TargetAcetylcholinesterase
LigandBDBM50135655
Substrate/Competitorn/a
Meas. Tech.ChEBML_27674
Ki 4000±n/a nM
Citation Lin, GTsai, HJTsai, YH Cage amines as the stopper inhibitors of cholinesterases. Bioorg Med Chem Lett13:2887-90 (2003) Acetylcholinesterase
Name:Acetylcholinesterase
Type:Enzyme
Mol. Mass.:71812.79
Organism:Electrophorus electricus (Electric eel)
Description:n/a
Residue:633
BDBM50135655
NameBDBM50135655
Synonyms:2,4,6,8,10,12-Hexabenzyl-2,4,6,8,10,12-hexaazatetracyclo[5.5.0.05,9.03,11]dodecane | CHEMBL318624
TypeSmall organic molecule
Emp. Form.C49H50N6
Mol. Mass.722.9615
SMILESC(NC1C2N(Cc3ccccc3)C3C(N(Cc4ccccc4)C4(CC4N2Cc2ccccc2)N3Cc2ccccc2)N1Cc1ccccc1)c1ccccc1