Reaction Details
TargetD(4) dopamine receptor
LigandBDBM50135726
Substrate/Competitorn/a
Meas. Tech.ChEBML_61005
Ki 3±n/a nM
Citation Thurkauf, AChen, XZhang, SGao, YKieltyka, AWasley, JWBrodbeck, RGreenlee, WGanguly, AZhao, H 1H-Pyrazolo-[3,4-c]cyclophepta[1,2-c]thiophenes: a unique structural class of dopamine D4 selective ligands. Bioorg Med Chem Lett13:2921-4 (2003) D(4) dopamine receptor
Name:D(4) dopamine receptor
Type:Enzyme
Mol. Mass.:48373.19
Organism:Homo sapiens (Human)
Description:P21917
Residue:419
BDBM50135726
NameBDBM50135726
Synonyms:1,6,8-Trimethyl-1,4-dihydro-5,7-dithia-1,2-diaza-as-indacene | CHEMBL100203
TypeSmall organic molecule
Emp. Form.C11H12N2S2
Mol. Mass.236.356
SMILESCc1sc(C)c-2c1SCc1cnn(C)c-21