Reaction Details
TargetFarnesyl pyrophosphate synthase
LigandBDBM50135816
Substrate/Competitorn/a
Meas. Tech.ChEMBL_69840 (CHEMBL681891)
Ki 110±n/a nM
Citation Sanders, JMGómez, AOMao, JMeints, GAVan Brussel, EMBurzynska, AKafarski, PGonzález-Pacanowska, DOldfield, E 3-D QSAR investigations of the inhibition of Leishmania major farnesyl pyrophosphate synthase by bisphosphonates. J Med Chem46:5171-83 (2003) 
 
Farnesyl pyrophosphate synthase
Name:Farnesyl pyrophosphate synthase
Type:Enzyme
Mol. Mass.:48272.89
Organism:Homo sapiens (Human)
Description:P14324
Residue:419
BDBM50135816
NameBDBM50135816
Synonyms:CHEMBL54480 | [(1-Methyl-hexylamino)-phosphono-methyl]-phosphonic acid
TypeSmall organic molecule
Emp. Form.C8H21NO6P2
Mol. Mass.289.203
SMILESCCCCCC(C)N=C(P(O)(O)O)P(O)(O)=O