Reaction Details
TargetFarnesyl pyrophosphate synthase
LigandBDBM50098378
Substrate/Competitorn/a
Meas. Tech.ChEMBL_69840 (CHEMBL681891)
Ki 14±n/a nM
Citation Sanders, JMGómez, AOMao, JMeints, GAVan Brussel, EMBurzynska, AKafarski, PGonzález-Pacanowska, DOldfield, E 3-D QSAR investigations of the inhibition of Leishmania major farnesyl pyrophosphate synthase by bisphosphonates. J Med Chem46:5171-83 (2003) 
 
Farnesyl pyrophosphate synthase
Name:Farnesyl pyrophosphate synthase
Type:Enzyme
Mol. Mass.:48272.89
Organism:Homo sapiens (Human)
Description:P14324
Residue:419
BDBM50098378
NameBDBM50098378
Synonyms:(1-Hydroxy-1-phosphono-2-pyridin-2-yl-ethyl)-phosphonic acid 2-(2-Hydroxy-2,2-bis-phosphono-ethyl)-pyridinium CHEMBL434024
TypeSmall organic molecule
Emp. Form.C7H11NO7P2
Mol. Mass.283.1123
SMILESOC(Cc1ccccn1)(P(O)(O)=O)P(O)(O)=O