Reaction Details
TargetFarnesyl pyrophosphate synthase
LigandBDBM50135838
Substrate/Competitorn/a
Meas. Tech.ChEMBL_69840 (CHEMBL681891)
Ki 49±n/a nM
Citation Sanders, JMGómez, AOMao, JMeints, GAVan Brussel, EMBurzynska, AKafarski, PGonzález-Pacanowska, DOldfield, E 3-D QSAR investigations of the inhibition of Leishmania major farnesyl pyrophosphate synthase by bisphosphonates. J Med Chem46:5171-83 (2003) 
 
Farnesyl pyrophosphate synthase
Name:Farnesyl pyrophosphate synthase
Type:Enzyme
Mol. Mass.:48272.89
Organism:Homo sapiens (Human)
Description:P14324
Residue:419
BDBM50135838
NameBDBM50135838
Synonyms:(Azepan-1-yl-phosphono-methyl)-phosphonic acid CHEMBL54472 azepan-1-ylmethylenediphosphonic acid
TypeSmall organic molecule
Emp. Form.C7H17NO6P2
Mol. Mass.273.1605
SMILESOP(O)(=O)C(N1CCCCCC1)P(O)(O)=O