Reaction Details
TargetFarnesyl pyrophosphate synthase
LigandBDBM12576
Substrate/Competitorn/a
Meas. Tech.ChEMBL_69839 (CHEMBL681890)
IC50 170±n/a nM
Citation Sanders, JMGómez, AOMao, JMeints, GAVan Brussel, EMBurzynska, AKafarski, PGonzález-Pacanowska, DOldfield, E 3-D QSAR investigations of the inhibition of Leishmania major farnesyl pyrophosphate synthase by bisphosphonates. J Med Chem46:5171-83 (2003) 
 
Farnesyl pyrophosphate synthase
Name:Farnesyl pyrophosphate synthase
Type:Enzyme
Mol. Mass.:48272.89
Organism:Homo sapiens (Human)
Description:P14324
Residue:419
BDBM12576
NameBDBM12576
Synonyms:Bisphosphonate 1 JMC515594 Compound 64 Risdronate [1-hydroxy-1-phosphono-2-(pyridin-3-yl)ethyl]phosphonic acid
TypeSmall organic molecule
Emp. Form.C7H11NO7P2
Mol. Mass.283.1123
SMILESOC(Cc1cccnc1)(P(O)(O)=O)P(O)(O)=O