Reaction Details
TargetFarnesyl pyrophosphate synthase
LigandBDBM50135831
Substrate/Competitorn/a
Meas. Tech.ChEMBL_69840 (CHEMBL681891)
Ki 43±n/a nM
Citation Sanders, JMGómez, AOMao, JMeints, GAVan Brussel, EMBurzynska, AKafarski, PGonzález-Pacanowska, DOldfield, E 3-D QSAR investigations of the inhibition of Leishmania major farnesyl pyrophosphate synthase by bisphosphonates. J Med Chem46:5171-83 (2003) 
 
Farnesyl pyrophosphate synthase
Name:Farnesyl pyrophosphate synthase
Type:Enzyme
Mol. Mass.:48272.89
Organism:Homo sapiens (Human)
Description:P14324
Residue:419
BDBM50135831
NameBDBM50135831
Synonyms:CHEMBL316844 | [1-Hydroxy-3-(3-phenoxy-propylamino)-1-phosphono-propyl]-phosphonic acid
TypeSmall organic molecule
Emp. Form.C12H21NO8P2
Mol. Mass.369.2446
SMILESOC(CCNCCCOc1ccccc1)(P(O)(O)=O)P(O)(O)=O