Reaction Details
TargetFarnesyl pyrophosphate synthase
LigandBDBM50135829
Substrate/Competitorn/a
Meas. Tech.ChEMBL_69840 (CHEMBL681891)
Ki 86.0±n/a nM
Citation Sanders, JMGómez, AOMao, JMeints, GAVan Brussel, EMBurzynska, AKafarski, PGonzález-Pacanowska, DOldfield, E 3-D QSAR investigations of the inhibition of Leishmania major farnesyl pyrophosphate synthase by bisphosphonates. J Med Chem46:5171-83 (2003) 
 
Farnesyl pyrophosphate synthase
Name:Farnesyl pyrophosphate synthase
Type:Enzyme
Mol. Mass.:48272.89
Organism:Homo sapiens (Human)
Description:P14324
Residue:419
BDBM50135829
NameBDBM50135829
Synonyms:(Bis-phosphono-methyl)-nonyl-ammonium (nonylamino)methylenediphosphonic acid N-nonyl-aminomethylene-1,1-bisphosphonate
TypeSmall organic molecule
Emp. Form.C10H25NO6P2
Mol. Mass.317.2561
SMILESCCCCCCCCCN=C(P(O)(O)O)P(O)(O)=O