Reaction Details
TargetFarnesyl pyrophosphate synthase
LigandBDBM25290
Substrate/Competitorn/a
Meas. Tech.ChEMBL_69840 (CHEMBL681891)
Ki 46±n/a nM
Citation Sanders, JMGómez, AOMao, JMeints, GAVan Brussel, EMBurzynska, AKafarski, PGonzález-Pacanowska, DOldfield, E 3-D QSAR investigations of the inhibition of Leishmania major farnesyl pyrophosphate synthase by bisphosphonates. J Med Chem46:5171-83 (2003) 
 
Farnesyl pyrophosphate synthase
Name:Farnesyl pyrophosphate synthase
Type:Enzyme
Mol. Mass.:48272.89
Organism:Homo sapiens (Human)
Description:P14324
Residue:419
BDBM25290
NameBDBM25290
Synonyms:CHEMBL56073 {1-hydroxy-3-[methyl(4-phenylbutyl)amino]-1-phosphonopropyl}phosphonic acid
TypeSmall organic molecule
Emp. Form.C14H25NO7P2
Mol. Mass.381.2983
SMILESCN(CCCCc1ccccc1)CCC(O)(P(O)(O)=O)P(O)(O)=O