Reaction Details
TargetFarnesyl pyrophosphate synthase
LigandBDBM50135833
Substrate/Competitorn/a
Meas. Tech.ChEMBL_69841 (CHEMBL857167)
IC50 363±n/a nM
Citation Sanders, JMGómez, AOMao, JMeints, GAVan Brussel, EMBurzynska, AKafarski, PGonzález-Pacanowska, DOldfield, E 3-D QSAR investigations of the inhibition of Leishmania major farnesyl pyrophosphate synthase by bisphosphonates. J Med Chem46:5171-83 (2003) 
 
Farnesyl pyrophosphate synthase
Name:Farnesyl pyrophosphate synthase
Type:Enzyme
Mol. Mass.:48272.89
Organism:Homo sapiens (Human)
Description:P14324
Residue:419
BDBM50135833
NameBDBM50135833
Synonyms:(2-methylbutyl)aminomethylene-1,1-bisphosphonate (Bis-phosphono-methyl)-(2-methyl-butyl)-ammonium [(2-Methyl-butylamino)-phosphono-methyl]-phosphonic acid
TypeSmall organic molecule
Emp. Form.C6H17NO6P2
Mol. Mass.261.1498
SMILESCCC(C)CN=C(P(O)(O)O)P(O)(O)=O