Reaction Details
TargetCarboxypeptidase B2
LigandBDBM50121929
Substrate/Competitorn/a
Meas. Tech.ChEMBL_45639 (CHEMBL655449)
IC50 1600±n/a nM
Citation Barrow, JCNantermet, PGStauffer, SRNgo, PLSteinbeiser, MAMao, SSCarroll, SSBailey, CColussi, DBosserman, MBurlein, CCook, JJSitko, GTiller, PRMiller-Stein, CMRose, MMcMasters, DRVacca, JPSelnick, HG Synthesis and evaluation of imidazole acetic acid inhibitors of activated thrombin-activatable fibrinolysis inhibitor as novel antithrombotics. J Med Chem46:5294-7 (2003) 
 
Carboxypeptidase B2
Name:Carboxypeptidase B2
Type:Enzyme
Mol. Mass.:48432.74
Organism:Homo sapiens (Human)
Description:Q96IY4
Residue:423
BDBM50121929
NameBDBM50121929
Synonyms:(phenylmethyl)butanedioic acid 2-benzylsuccinic acid alpha-benzylsuccinic acid beta-carboxybenzenebutanoic acid
TypeSmall organic molecule
Emp. Form.C11H12O4
Mol. Mass.208.2106
SMILESOC(=O)CC(Cc1ccccc1)C(O)=O