Reaction Details
TargetCarboxypeptidase M
LigandBDBM50121929
Substrate/Competitorn/a
Meas. Tech.ChEMBL_45790 (CHEMBL660086)
IC50>50000±n/a nM
Citation Barrow, JCNantermet, PGStauffer, SRNgo, PLSteinbeiser, MAMao, SSCarroll, SSBailey, CColussi, DBosserman, MBurlein, CCook, JJSitko, GTiller, PRMiller-Stein, CMRose, MMcMasters, DRVacca, JPSelnick, HG Synthesis and evaluation of imidazole acetic acid inhibitors of activated thrombin-activatable fibrinolysis inhibitor as novel antithrombotics. J Med Chem46:5294-7 (2003) 
 
Carboxypeptidase M
Name:Carboxypeptidase M
Type:PROTEIN
Mol. Mass.:50519.81
Organism:Homo sapiens (Human)
Description:ChEMBL_45790
Residue:443
BDBM50121929
NameBDBM50121929
Synonyms:(phenylmethyl)butanedioic acid 2-benzylsuccinic acid alpha-benzylsuccinic acid beta-carboxybenzenebutanoic acid
TypeSmall organic molecule
Emp. Form.C11H12O4
Mol. Mass.208.2106
SMILESOC(=O)CC(Cc1ccccc1)C(O)=O