Reaction Details
TargetTGF-beta receptor type-1
LigandBDBM21492
Substrate/Competitorn/a
Meas. Tech.ChEMBL_208099 (CHEMBL814455)
Kd 5±n/a nM
Citation Singh, JChuaqui, CEBoriack-Sjodin, PALee, WCPontz, TCorbley, MJCheung, HKArduini, RMMead, JNNewman, MNPapadatos, JLBowes, SJosiah, SLing, LE Successful shape-based virtual screening: the discovery of a potent inhibitor of the type I TGFbeta receptor kinase (TbetaRI). Bioorg Med Chem Lett13:4355-9 (2003) TGF-beta receptor type-1
Name:TGF-beta receptor type-1
Type:enzyme
Mol. Mass.:55968.24
Organism:Homo sapiens (Human)
Description:P36897
Residue:503
BDBM21492
NameBDBM21492
Synonyms:4-[3-(pyridin-2-yl)-1H-pyrazol-4-yl]quinoline LY364947 US9138393, LY-364947 | US9144538, LY-364947
TypeSmall organic molecule
Emp. Form.C17H12N4
Mol. Mass.272.304
SMILESc1[nH]nc(c1-c1ccnc2ccccc12)-c1ccccn1