Reaction Details
TargetCytosolic phospholipase A2
LigandBDBM50136741
Substrate/Competitorn/a
Meas. Tech.ChEMBL_52521 (CHEMBL665294)
IC50 2100±n/a nM
Citation McKew, JCLovering, FClark, JDBemis, JXiang, YShen, MZhang, WAlvarez, JCJoseph-McCarthy, D Structure-activity relationships of indole cytosolic phospholipase A(2)alpha inhibitors: substrate mimetics. Bioorg Med Chem Lett13:4501-4 (2003) Cytosolic phospholipase A2
Name:Cytosolic phospholipase A2
Type:Protein
Mol. Mass.:85219.30
Organism:Homo sapiens (Human)
Description:P47712
Residue:749
BDBM50136741
NameBDBM50136741
Synonyms:4-(1-Benzhydryl-7-chloro-1H-indol-3-ylmethyl)-3-methoxy-benzoic acid | CHEMBL343391
TypeSmall organic molecule
Emp. Form.C30H24ClNO3
Mol. Mass.481.969
SMILESCOc1cc(ccc1Cc1cn(C(c2ccccc2)c2ccccc2)c2c(Cl)cccc12)C(O)=O