Reaction Details
TargetCytosolic phospholipase A2
LigandBDBM50136724
Substrate/Competitorn/a
Meas. Tech.ChEBML_52418
IC50 900±n/a nM
Citation McKew, JCLovering, FClark, JDBemis, JXiang, YShen, MZhang, WAlvarez, JCJoseph-McCarthy, D Structure-activity relationships of indole cytosolic phospholipase A(2)alpha inhibitors: substrate mimetics. Bioorg Med Chem Lett13:4501-4 (2003) Cytosolic phospholipase A2
Name:Cytosolic phospholipase A2
Type:Protein
Mol. Mass.:85219.30
Organism:Homo sapiens (Human)
Description:P47712
Residue:749
BDBM50136724
NameBDBM50136724
Synonyms:4-(1-Benzhydryl-5-methyl-1H-indol-3-ylmethyl)-3-methoxy-benzoic acid | CHEMBL337790
TypeSmall organic molecule
Emp. Form.C31H27NO3
Mol. Mass.461.551
SMILESCOc1cc(ccc1Cc1cn(C(c2ccccc2)c2ccccc2)c2ccc(C)cc12)C(O)=O