Reaction Details
Target5'-methylthioadenosine/S-adenosylhomocysteine nucleosidase
LigandBDBM50136907
Substrate/Competitorn/a
Meas. Tech.ChEMBL_103130 (CHEMBL712301)
Ki 36±n/a nM
Citation Li, XChu, SFeher, VAKhalili, MNie, ZMargosiak, SNikulin, VLevin, JSprankle, KGTedder, MEAlmassy, RAppelt, KYager, KM Structure-based design, synthesis, and antimicrobial activity of indazole-derived SAH/MTA nucleosidase inhibitors. J Med Chem46:5663-73 (2003) 
 
5'-methylthioadenosine/S-adenosylhomocysteine nucleosidase
Name:5'-methylthioadenosine/S-adenosylhomocysteine nucleosidase
Type:Enzyme
Mol. Mass.:24347.14
Organism:Escherichia coli (strain K12)
Description:P0AF12
Residue:232
BDBM50136907
NameBDBM50136907
Synonyms:CHEMBL153876 | N-(3-Chloro-7-isobutylamino-1H-indazol-5-yl)-3-(2-methyl-pyrimidin-4-yl)-benzenesulfonamide
TypeSmall organic molecule
Emp. Form.C22H23ClN6O2S
Mol. Mass.470.975
SMILESCC(C)CNc1cc(NS(=O)(=O)c2cccc(c2)-c2ccnc(C)n2)cc2c(Cl)[nH]nc12