Reaction Details
Target5'-methylthioadenosine/S-adenosylhomocysteine nucleosidase
LigandBDBM50136911
Substrate/Competitorn/a
Meas. Tech.ChEMBL_103130 (CHEMBL712301)
Ki 13±n/a nM
Citation Li, XChu, SFeher, VAKhalili, MNie, ZMargosiak, SNikulin, VLevin, JSprankle, KGTedder, MEAlmassy, RAppelt, KYager, KM Structure-based design, synthesis, and antimicrobial activity of indazole-derived SAH/MTA nucleosidase inhibitors. J Med Chem46:5663-73 (2003) 
 
5'-methylthioadenosine/S-adenosylhomocysteine nucleosidase
Name:5'-methylthioadenosine/S-adenosylhomocysteine nucleosidase
Type:Enzyme
Mol. Mass.:24347.14
Organism:Escherichia coli (strain K12)
Description:P0AF12
Residue:232
BDBM50136911
NameBDBM50136911
Synonyms:4'-Trifluoromethyl-biphenyl-3-sulfonic acid (3-chloro-7-isobutylamino-1H-indazol-5-yl)-amide | CHEMBL421824
TypeSmall organic molecule
Emp. Form.C24H22ClF3N4O2S
Mol. Mass.522.97
SMILESCC(C)CNc1cc(NS(=O)(=O)c2cccc(c2)-c2ccc(cc2)C(F)(F)F)cc2c(Cl)[nH]nc12