Reaction Details
Target5'-methylthioadenosine/S-adenosylhomocysteine nucleosidase
LigandBDBM50136913
Substrate/Competitorn/a
Meas. Tech.ChEMBL_103130 (CHEMBL712301)
Ki 10.8±n/a nM
Citation Li, XChu, SFeher, VAKhalili, MNie, ZMargosiak, SNikulin, VLevin, JSprankle, KGTedder, MEAlmassy, RAppelt, KYager, KM Structure-based design, synthesis, and antimicrobial activity of indazole-derived SAH/MTA nucleosidase inhibitors. J Med Chem46:5663-73 (2003) 
 
5'-methylthioadenosine/S-adenosylhomocysteine nucleosidase
Name:5'-methylthioadenosine/S-adenosylhomocysteine nucleosidase
Type:Enzyme
Mol. Mass.:24347.14
Organism:Escherichia coli (strain K12)
Description:P0AF12
Residue:232
BDBM50136913
NameBDBM50136913
Synonyms:CHEMBL156794 | N-(3-Chloro-7-isobutylamino-1H-indazol-5-yl)-3-quinolin-3-yl-benzenesulfonamide
TypeSmall organic molecule
Emp. Form.C26H24ClN5O2S
Mol. Mass.506.019
SMILESCC(C)CNc1cc(NS(=O)(=O)c2cccc(c2)-c2cnc3ccccc3c2)cc2c(Cl)[nH]nc12