Reaction Details
Target5'-methylthioadenosine/S-adenosylhomocysteine nucleosidase
LigandBDBM50136917
Substrate/Competitorn/a
Meas. Tech.ChEMBL_103130 (CHEMBL712301)
Ki 11000±n/a nM
Citation Li, XChu, SFeher, VAKhalili, MNie, ZMargosiak, SNikulin, VLevin, JSprankle, KGTedder, MEAlmassy, RAppelt, KYager, KM Structure-based design, synthesis, and antimicrobial activity of indazole-derived SAH/MTA nucleosidase inhibitors. J Med Chem46:5663-73 (2003) 
 
5'-methylthioadenosine/S-adenosylhomocysteine nucleosidase
Name:5'-methylthioadenosine/S-adenosylhomocysteine nucleosidase
Type:Enzyme
Mol. Mass.:24347.14
Organism:Escherichia coli (strain K12)
Description:P0AF12
Residue:232
BDBM50136917
NameBDBM50136917
Synonyms:CHEMBL345702 | N-[3-Chloro-5-(4-chloro-benzenesulfonylamino)-1H-indazol-7-yl]-acetamide
TypeSmall organic molecule
Emp. Form.C15H12Cl2N4O3S
Mol. Mass.399.252
SMILESCC(=O)Nc1cc(NS(=O)(=O)c2ccc(Cl)cc2)cc2c(Cl)[nH]nc12