Reaction Details
Target5'-methylthioadenosine/S-adenosylhomocysteine nucleosidase
LigandBDBM50136927
Substrate/Competitorn/a
Meas. Tech.ChEMBL_103130 (CHEMBL712301)
Ki 500±n/a nM
Citation Li, XChu, SFeher, VAKhalili, MNie, ZMargosiak, SNikulin, VLevin, JSprankle, KGTedder, MEAlmassy, RAppelt, KYager, KM Structure-based design, synthesis, and antimicrobial activity of indazole-derived SAH/MTA nucleosidase inhibitors. J Med Chem46:5663-73 (2003) 
 
5'-methylthioadenosine/S-adenosylhomocysteine nucleosidase
Name:5'-methylthioadenosine/S-adenosylhomocysteine nucleosidase
Type:Enzyme
Mol. Mass.:24347.14
Organism:Escherichia coli (strain K12)
Description:P0AF12
Residue:232
BDBM50136927
NameBDBM50136927
Synonyms:4-Chloro-N-[3-chloro-7-(cyclopropylmethyl-amino)-1H-indazol-5-yl]-benzenesulfonamide | CHEMBL154601
TypeSmall organic molecule
Emp. Form.C17H16Cl2N4O2S
Mol. Mass.411.306
SMILESClc1n[nH]c2c(NCC3CC3)cc(NS(=O)(=O)c3ccc(Cl)cc3)cc12