Reaction Details
Target5'-methylthioadenosine/S-adenosylhomocysteine nucleosidase
LigandBDBM50136929
Substrate/Competitorn/a
Meas. Tech.ChEMBL_103130 (CHEMBL712301)
Ki 17000±n/a nM
Citation Li, XChu, SFeher, VAKhalili, MNie, ZMargosiak, SNikulin, VLevin, JSprankle, KGTedder, MEAlmassy, RAppelt, KYager, KM Structure-based design, synthesis, and antimicrobial activity of indazole-derived SAH/MTA nucleosidase inhibitors. J Med Chem46:5663-73 (2003) 
 
5'-methylthioadenosine/S-adenosylhomocysteine nucleosidase
Name:5'-methylthioadenosine/S-adenosylhomocysteine nucleosidase
Type:Enzyme
Mol. Mass.:24347.14
Organism:Escherichia coli (strain K12)
Description:P0AF12
Residue:232
BDBM50136929
NameBDBM50136929
Synonyms:4-Chloro-N-(1H-indazol-6-yl)-benzenesulfonamide | CHEMBL424146
TypeSmall organic molecule
Emp. Form.C13H10ClN3O2S
Mol. Mass.307.755
SMILESClc1ccc(cc1)S(=O)(=O)Nc1ccc2c[nH]nc2c1