Reaction Details
TargetEpidermal growth factor receptor
LigandBDBM50137173
Substrate/Competitorn/a
Meas. Tech.ChEBML_67058
IC50 5.0±n/a nM
Citation Munchhof, MJBeebe, JSCasavant, JMCooper, BADoty, JLHigdon, RCHillerman, SMSoderstrom, CIKnauth, EAMarx, MARossi, AMSobolov, SBSun, J Design and SAR of thienopyrimidine and thienopyridine inhibitors of VEGFR-2 kinase activity. Bioorg Med Chem Lett14:21-4 (2003) Epidermal growth factor receptor
Name:Epidermal growth factor receptor
Type:Receptor Kinase Domain
Mol. Mass.:134279.59
Organism:Homo sapiens (Human)
Description:P00533
Residue:1210
BDBM50137173
NameBDBM50137173
Synonyms:CHEMBL312818 | N*6*-Imidazol-1-yl-N*4*-(1H-indol-5-yl)-N*6*-(3-phenyl-propyl)-thieno[3,2-d]pyrimidine-4,6-diamine
TypeSmall organic molecule
Emp. Form.C26H23N7S
Mol. Mass.465.573
SMILESC(CN(c1cc2ncnc(Nc3ccc4[nH]ccc4c3)c2s1)n1ccnc1)Cc1ccccc1