Reaction Details
TargetVascular endothelial growth factor receptor 1
LigandBDBM50137179
Substrate/Competitorn/a
Meas. Tech.ChEBML_213951
IC50 5±n/a nM
Citation Munchhof, MJBeebe, JSCasavant, JMCooper, BADoty, JLHigdon, RCHillerman, SMSoderstrom, CIKnauth, EAMarx, MARossi, AMSobolov, SBSun, J Design and SAR of thienopyrimidine and thienopyridine inhibitors of VEGFR-2 kinase activity. Bioorg Med Chem Lett14:21-4 (2003) Vascular endothelial growth factor receptor 1
Name:Vascular endothelial growth factor receptor 1
Type:Receptor Tyrosine Kinase
Mol. Mass.:150800.23
Organism:Homo sapiens (Human)
Description:P17948
Residue:1338
BDBM50137179
NameBDBM50137179
Synonyms:2-(2-{4-[7-(2-Methyl-1H-indol-5-ylamino)-thieno[3,2-b]pyridin-2-yl]-benzylamino}-ethoxy)-ethanol | CHEMBL77342
TypeSmall organic molecule
Emp. Form.C27H28N4O2S
Mol. Mass.472.602
SMILESCc1cc2cc(Nc3ccnc4cc(sc34)-c3ccc(CNCCOCCO)cc3)ccc2[nH]1