Reaction Details
TargetEpidermal growth factor receptor
LigandBDBM50137193
Substrate/Competitorn/a
Meas. Tech.ChEBML_67058
IC50 1±n/a nM
Citation Munchhof, MJBeebe, JSCasavant, JMCooper, BADoty, JLHigdon, RCHillerman, SMSoderstrom, CIKnauth, EAMarx, MARossi, AMSobolov, SBSun, J Design and SAR of thienopyrimidine and thienopyridine inhibitors of VEGFR-2 kinase activity. Bioorg Med Chem Lett14:21-4 (2003) Epidermal growth factor receptor
Name:Epidermal growth factor receptor
Type:Receptor Kinase Domain
Mol. Mass.:134279.59
Organism:Homo sapiens (Human)
Description:P00533
Residue:1210
BDBM50137193
NameBDBM50137193
Synonyms:CHEMBL79215 | N*4*-(1H-Indol-5-yl)-N*6*-(2-phenylamino-ethyl)-N*6*-pyrrol-1-yl-thieno[3,2-d]pyrimidine-4,6-diamine
TypeSmall organic molecule
Emp. Form.C26H23N7S
Mol. Mass.465.573
SMILESC(CN(c1cc2ncnc(Nc3ccc4[nH]ccc4c3)c2s1)n1cccc1)Nc1ccccc1