Reaction Details
TargetEpidermal growth factor receptor
LigandBDBM50137190
Substrate/Competitorn/a
Meas. Tech.ChEBML_67058
IC50 1±n/a nM
Citation Munchhof, MJBeebe, JSCasavant, JMCooper, BADoty, JLHigdon, RCHillerman, SMSoderstrom, CIKnauth, EAMarx, MARossi, AMSobolov, SBSun, J Design and SAR of thienopyrimidine and thienopyridine inhibitors of VEGFR-2 kinase activity. Bioorg Med Chem Lett14:21-4 (2003) Epidermal growth factor receptor
Name:Epidermal growth factor receptor
Type:Receptor Kinase Domain
Mol. Mass.:134279.59
Organism:Homo sapiens (Human)
Description:P00533
Residue:1210
BDBM50137190
NameBDBM50137190
Synonyms:(1H-Indol-5-yl)-(2-thiophen-2-yl-thieno[3,2-b]pyridin-7-yl)-amine | CHEMBL310853
TypeSmall organic molecule
Emp. Form.C19H13N3S2
Mol. Mass.347.457
SMILESN(c1ccc2[nH]ccc2c1)c1ccnc2cc(sc12)-c1cccs1