Reaction Details
TargetEpidermal growth factor receptor
LigandBDBM50137185
Substrate/Competitorn/a
Meas. Tech.ChEBML_67058
IC50 68±n/a nM
Citation Munchhof, MJBeebe, JSCasavant, JMCooper, BADoty, JLHigdon, RCHillerman, SMSoderstrom, CIKnauth, EAMarx, MARossi, AMSobolov, SBSun, J Design and SAR of thienopyrimidine and thienopyridine inhibitors of VEGFR-2 kinase activity. Bioorg Med Chem Lett14:21-4 (2003) Epidermal growth factor receptor
Name:Epidermal growth factor receptor
Type:Receptor Kinase Domain
Mol. Mass.:134279.59
Organism:Homo sapiens (Human)
Description:P00533
Residue:1210
BDBM50137185
NameBDBM50137185
Synonyms:(1H-Indol-5-yl)-(6-phenyl-thieno[3,2-d]pyrimidin-4-yl)-amine | CHEMBL76432
TypeSmall organic molecule
Emp. Form.C20H14N4S
Mol. Mass.342.417
SMILESN(c1ccc2[nH]ccc2c1)c1ncnc2cc(sc12)-c1ccccc1