Reaction Details
TargetMatrix metalloproteinase-9
LigandBDBM50137284
Substrate/Competitorn/a
Meas. Tech.ChEBML_105527
IC50 335±n/a nM
Citation Ma, DWu, WYang, GLi, JLi, JYe, Q Tetrahydroisoquinoline based sulfonamide hydroxamates as potent matrix metalloproteinase inhibitors. Bioorg Med Chem Lett14:47-50 (2003) Matrix metalloproteinase-9
Name:Matrix metalloproteinase-9
Type:Enzyme
Mol. Mass.:78452.28
Organism:Homo sapiens (Human)
Description:P14780
Residue:707
BDBM50137284
NameBDBM50137284
Synonyms:2-Benzenesulfonyl-6-hydroxy-1,2,3,4-tetrahydro-isoquinoline-1-carboxylic acid hydroxyamide | CHEMBL146289
TypeSmall organic molecule
Emp. Form.C16H16N2O5S
Mol. Mass.348.374
SMILESONC(=O)C1N(CCc2cc(O)ccc12)S(=O)(=O)c1ccccc1