Reaction Details
TargetMatrix metalloproteinase-14
LigandBDBM50137286
Substrate/Competitorn/a
Meas. Tech.ChEBML_106791
IC50 3108±n/a nM
Citation Ma, DWu, WYang, GLi, JLi, JYe, Q Tetrahydroisoquinoline based sulfonamide hydroxamates as potent matrix metalloproteinase inhibitors. Bioorg Med Chem Lett14:47-50 (2003) Matrix metalloproteinase-14
Name:Matrix metalloproteinase-14
Type:Protein
Mol. Mass.:65900.19
Organism:Homo sapiens (Human)
Description:P50281
Residue:582
BDBM50137286
NameBDBM50137286
Synonyms:6-Hydroxy-2-(4-methoxy-benzenesulfonyl)-1,2,3,4-tetrahydro-isoquinoline-1-carboxylic acid hydroxyamide | CHEMBL356124
TypeSmall organic molecule
Emp. Form.C17H18N2O6S
Mol. Mass.378.4
SMILESCOc1ccc(cc1)S(=O)(=O)N1CCc2cc(O)ccc2C1C(=O)NO