Reaction Details
TargetMatrix metalloproteinase-9
LigandBDBM50137283
Substrate/Competitorn/a
Meas. Tech.ChEBML_105527
IC50 30±n/a nM
Citation Ma, DWu, WYang, GLi, JLi, JYe, Q Tetrahydroisoquinoline based sulfonamide hydroxamates as potent matrix metalloproteinase inhibitors. Bioorg Med Chem Lett14:47-50 (2003) Matrix metalloproteinase-9
Name:Matrix metalloproteinase-9
Type:Enzyme
Mol. Mass.:78452.28
Organism:Homo sapiens (Human)
Description:P14780
Residue:707
BDBM50137283
NameBDBM50137283
Synonyms:6-(benzyloxy)-N-hydroxy-2-(4-methoxyphenylsulfonyl)-1,2,3,4-tetrahydroisoquinoline-1-carboxamide CHEMBL358539
TypeSmall organic molecule
Emp. Form.C24H24N2O6S
Mol. Mass.468.522
SMILESCOc1ccc(cc1)S(=O)(=O)N1CCc2cc(OCc3ccccc3)ccc2C1C(=O)NO