Reaction Details
TargetMatrix metalloproteinase-16
LigandBDBM50137280
Substrate/Competitorn/a
Meas. Tech.ChEBML_106799
IC50 4633±n/a nM
Citation Ma, DWu, WYang, GLi, JLi, JYe, Q Tetrahydroisoquinoline based sulfonamide hydroxamates as potent matrix metalloproteinase inhibitors. Bioorg Med Chem Lett14:47-50 (2003) Matrix metalloproteinase-16
Name:Matrix metalloproteinase-16
Type:PROTEIN
Mol. Mass.:69536.76
Organism:Homo sapiens (Human)
Description:ChEMBL_799129
Residue:607
BDBM50137280
NameBDBM50137280
Synonyms:6-Benzyloxy-2-(2,5-dichloro-benzenesulfonyl)-1,2,3,4-tetrahydro-isoquinoline-1-carboxylic acid hydroxyamide | CHEMBL147604
TypeSmall organic molecule
Emp. Form.C23H20Cl2N2O5S
Mol. Mass.507.386
SMILESONC(=O)C1N(CCc2cc(OCc3ccccc3)ccc12)S(=O)(=O)c1cc(Cl)ccc1Cl