Reaction Details
TargetMatrix metalloproteinase-16
LigandBDBM50137277
Substrate/Competitorn/a
Meas. Tech.ChEBML_106799
IC50 202±n/a nM
Citation Ma, DWu, WYang, GLi, JLi, JYe, Q Tetrahydroisoquinoline based sulfonamide hydroxamates as potent matrix metalloproteinase inhibitors. Bioorg Med Chem Lett14:47-50 (2003) Matrix metalloproteinase-16
Name:Matrix metalloproteinase-16
Type:PROTEIN
Mol. Mass.:69536.76
Organism:Homo sapiens (Human)
Description:ChEMBL_799129
Residue:607
BDBM50137277
NameBDBM50137277
Synonyms:2-(4-Amino-benzenesulfonyl)-6-hydroxy-1,2,3,4-tetrahydro-isoquinoline-1-carboxylic acid hydroxyamide | CHEMBL148406
TypeSmall organic molecule
Emp. Form.C16H17N3O5S
Mol. Mass.363.388
SMILESNc1ccc(cc1)S(=O)(=O)N1CCc2cc(O)ccc2C1C(=O)NO